Reaction Details
TargetCollagenase ColG
LigandBDBM11810
Substrate/CompetitorBDBM11462
Meas. Tech.ChC Enzyme Inhibition Assay
Ki 14±n/a nM
Citation Scozzafava, ASupuran, CT Protease inhibitors. Part 8: synthesis of potent Clostridium histolyticum collagenase inhibitors incorporating sulfonylated L-alanine hydroxamate moieties. Bioorg Med Chem8:637-45 (2000) 
 
Collagenase ColG
Name:Collagenase ColG
Type:Enzyme
Mol. Mass.:126246.16
Organism:Clostridium histolyticum
Description:Q9S0X0
Residue:1118
BDBM11810
BDBM11462
NameBDBM11810
Synonyms:2-{[(2-chlorophenyl)methyl][(2,4-difluorophenyl)carbamoyl]amino}-N-hydroxypropanamide | hydroxamate deriv. F4
TypeSmall organic molecule
Emp. Form.C17H16ClF2N3O3
Mol. Mass.383.777
SMILESCC(N(Cc1ccccc1Cl)C(=O)Nc1ccc(F)cc1F)C(=O)NO