Reaction Details
TargetADP-ribosyl cyclase/cyclic ADP-ribose hydrolase [1-303]
LigandBDBM65500
Substrate/CompetitorBDBM65498
Meas. Tech.NAD glycohydrolase assay
pH7.4±0
Temperature310.15±0 K
IC50 2200±0 nM
Citation Muller-Steffner, HJacques, SAKuhn, ISchultz, MDBotta, DOsswald, PMaechling, CLund, FEKellenberger, E Efficient Inhibition of SmNACE by Coordination Complexes Is Abolished by S. mansoni Sequestration of Metal. ACS Chem Biol12:1787-1795 (2017) 
 
ADP-ribosyl cyclase/cyclic ADP-ribose hydrolase [1-303]
Name:ADP-ribosyl cyclase/cyclic ADP-ribose hydrolase [1-303]
Synonyms:C-His6-SmNACE
Type:Protein
Mol. Mass.:35588.81
Organism:Schistosoma mansoni
Description:Q32TF5 6 His tagged
Residue:309
BDBM65500
BDBM65498
NameBDBM65500
Synonyms:SmNACE inhibitor, 3
TypeSmall organic molecule
Emp. Form.C13H8N2O3S
Mol. Mass.272.279
SMILESO=C(Nc1nc(=O)c2ccccc2s1)c1ccco1