Reaction Details
Target5-hydroxytryptamine receptor 4
LigandBDBM50079375
Substrate/Competitorn/a
Meas. Tech.Competition Assay
Ki 0.900±n/a nM
Citation Dallemagne, PRochais, CLecoutey, CBoulouard, MFreret, T Acetylcholinesterase inhibitors and promnesiant serotonin 5-HT4 receptor agonists, their methods of preparation and the pharmaceutical compositions containing the same US Patent US9663465 Publication Date 5/30/2017
 
5-hydroxytryptamine receptor 4
Name:5-hydroxytryptamine receptor 4
Type:Enzyme
Mol. Mass.:43767.54
Organism:Homo sapiens (Human)
Description:Q13639
Residue:388
BDBM50079375
NameBDBM50079375
Synonyms:CHEMBL3417008 | US9663465, 20
TypeSmall organic molecule
Emp. Form.C21H31ClN2O3
Mol. Mass.394.935
SMILESCOc1cc(N)c(Cl)cc1C(=O)OCC1CCN(CC2CCCCC2)CC1