Reaction Details
TargetSerine/threonine-protein kinase Chk1
LigandBDBM328996
Substrate/Competitorn/a
Meas. Tech.Caliper Assay
IC50 2.00±n/a nM
Citation Collins, IMatthews, TPMchardy, TFOsborne, JLainchbury, MWalton, MIGarrett, MD 5-[[4-[[morpholin-2-yl]methylamino]-5-(trifluoromethyl)-2-pyridyl]amino]pyrazine-2-carbonitrile and therapeutic uses thereof US Patent US9663503 Publication Date 5/30/2017
 
Serine/threonine-protein kinase Chk1
Name:Serine/threonine-protein kinase Chk1
Type:Enzyme Catalytic Domain
Mol. Mass.:54443.02
Organism:Homo sapiens (Human)
Description:gi_166295192
Residue:476
BDBM328996
NameBDBM328996
Synonyms:1137477-07-6 US9663503, Compound Y-081
TypeSmall organic molecule
Emp. Form.C17H19N7O3
Mol. Mass.369.3779
SMILESCOC(=O)c1cnc(Nc2cnc(cn2)C#N)cc1NCC1CNCCO1