Reaction Details
TargetSerine/threonine-protein kinase Chk1
LigandBDBM329004
Substrate/Competitorn/a
Meas. Tech.Caliper Assay
IC50 11.0±n/a nM
Citation Collins, IMatthews, TPMchardy, TFOsborne, JLainchbury, MWalton, MIGarrett, MD 5-[[4-[[morpholin-2-yl]methylamino]-5-(trifluoromethyl)-2-pyridyl]amino]pyrazine-2-carbonitrile and therapeutic uses thereof US Patent US9663503 Publication Date 5/30/2017
 
Serine/threonine-protein kinase Chk1
Name:Serine/threonine-protein kinase Chk1
Type:Enzyme Catalytic Domain
Mol. Mass.:54443.02
Organism:Homo sapiens (Human)
Description:gi_166295192
Residue:476
BDBM329004
NameBDBM329004
Synonyms:1168103-91-0 US9663503, Compound Y-146
TypeSmall organic molecule
Emp. Form.C22H23N7O2
Mol. Mass.417.4637
SMILESCOc1ccc(cc1)-c1cnc(Nc2cnc(cn2)C#N)cc1NC[C@@H]1CNCCO1