Reaction Details
TargetMetabotropic glutamate receptor 2
LigandBDBM212882
Substrate/Competitorn/a
Meas. Tech.Biological Assay
IC50 5.00±n/a nM
Citation Bungard, CJConverso, ADe Leon, PHanney, BHartingh, TJManikowski, JJManley, PJMeissner, RMeng, ZPerkins, JJRudd, MTShu, Y Quinoline carboxamide and quinoline carbonitrile derivatives as mGluR2-negative allosteric modulators, compositions, and their use US Patent US9663506 Publication Date 5/30/2017
 
Metabotropic glutamate receptor 2
Name:Metabotropic glutamate receptor 2
Type:Enzyme
Mol. Mass.:95584.88
Organism:Homo sapiens (Human)
Description:Q14416
Residue:872
BDBM212882
NameBDBM212882
Synonyms:US9278960, 2-29 | US9663506, Example 2-29
TypeSmall organic molecule
Emp. Form.C22H19N3O3
Mol. Mass.373.4046
SMILESCc1ccc(cc1)-c1cc(nc2cc(CN3C(=O)CCC3=O)ccc12)C(N)=O