Reaction Details
TargetMetabotropic glutamate receptor 2
LigandBDBM213074
Substrate/Competitorn/a
Meas. Tech.Biological Assay
IC50 6.00±n/a nM
Citation Bungard, CJConverso, ADe Leon, PHanney, BHartingh, TJManikowski, JJManley, PJMeissner, RMeng, ZPerkins, JJRudd, MTShu, Y Quinoline carboxamide and quinoline carbonitrile derivatives as mGluR2-negative allosteric modulators, compositions, and their use US Patent US9663506 Publication Date 5/30/2017
 
Metabotropic glutamate receptor 2
Name:Metabotropic glutamate receptor 2
Type:Enzyme
Mol. Mass.:95584.88
Organism:Homo sapiens (Human)
Description:Q14416
Residue:872
BDBM213074
NameBDBM213074
Synonyms:US9278960, 6-21 | US9663506, Example 6-21
TypeSmall organic molecule
Emp. Form.C21H16F3N5O
Mol. Mass.411.3798
SMILESCn1cc(cn1)-c1cc(nc2cc(Cc3ccnc(c3)C(F)(F)F)ccc12)C(N)=O