Reaction Details
TargetMetabotropic glutamate receptor 2
LigandBDBM213133
Substrate/Competitorn/a
Meas. Tech.Biological Assay
IC50 5.00±n/a nM
Citation Bungard, CJConverso, ADe Leon, PHanney, BHartingh, TJManikowski, JJManley, PJMeissner, RMeng, ZPerkins, JJRudd, MTShu, Y Quinoline carboxamide and quinoline carbonitrile derivatives as mGluR2-negative allosteric modulators, compositions, and their use US Patent US9663506 Publication Date 5/30/2017
 
Metabotropic glutamate receptor 2
Name:Metabotropic glutamate receptor 2
Type:Enzyme
Mol. Mass.:95584.88
Organism:Homo sapiens (Human)
Description:Q14416
Residue:872
BDBM213133
NameBDBM213133
Synonyms:US9278960, 8-40 US9636337, 8-41
TypeSmall organic molecule
Emp. Form.C25H23N3O2
Mol. Mass.397.469
SMILESCOc1ccc(cc1)-c1cc(nc2cc(ccc12)C(C)Cc1cccnc1)C(N)=O