Reaction Details
TargetSphingosine 1-phosphate receptor 5
LigandBDBM329373
Substrate/Competitorn/a
Meas. Tech.In Vitro Binding Assay
IC50 8.70±n/a nM
Citation Swenson, RE Sphingosine 1-phosphate receptor antagonists US Patent US9663511 Publication Date 5/30/2017
 
Sphingosine 1-phosphate receptor 5
Name:Sphingosine 1-phosphate receptor 5
Type:G Protein-Coupled Receptor (GPCR)
Mol. Mass.:41796.42
Organism:Homo sapiens (Human)
Description:n/a
Residue:398
BDBM329373
NameBDBM329373
Synonyms:US9663511, Compound 6.
TypeSmall organic molecule
Emp. Form.C19H20Cl2N6O2
Mol. Mass.435.307
SMILESCC(C)c1cc(ONC(=O)Nc2cc(Cl)nc(Cl)c2)nc2n(CC=C)nc(C)c12