Reaction Details
TargetSphingosine 1-phosphate receptor 5
LigandBDBM329376
Substrate/Competitorn/a
Meas. Tech.In Vitro Binding Assay
IC50<10.00±n/a nM
Citation Swenson, RE Sphingosine 1-phosphate receptor antagonists US Patent US9663511 Publication Date 5/30/2017
 
Sphingosine 1-phosphate receptor 5
Name:Sphingosine 1-phosphate receptor 5
Type:G Protein-Coupled Receptor (GPCR)
Mol. Mass.:41796.42
Organism:Homo sapiens (Human)
Description:n/a
Residue:398
BDBM329376
NameBDBM329376
Synonyms:US9663511, Compound 33.
TypeSmall organic molecule
Emp. Form.C19H23Cl2N7O2
Mol. Mass.452.338
SMILESCC(C)c1cc(NNC(=O)Nc2cc(Cl)nc(Cl)c2)nc2c(CCCO)nn(C)c12