Reaction Details
TargetcAMP and cAMP-inhibited cGMP 3',5'-cyclic phosphodiesterase 10A
LigandBDBM329425
Substrate/Competitorn/a
Meas. Tech.Fluorescence Polarization Assay
Ki 0.030±n/a nM
Citation Kuduk, SDMcComas, CCReger, TS Pyrimidine PDE10 inhibitors US Patent US9663513 Publication Date 5/30/2017
 
cAMP and cAMP-inhibited cGMP 3',5'-cyclic phosphodiesterase 10A
Name:cAMP and cAMP-inhibited cGMP 3',5'-cyclic phosphodiesterase 10A
Type:Protein
Mol. Mass.:88412.52
Organism:Homo sapiens (Human)
Description:Q9Y233
Residue:779
BDBM329425
NameBDBM329425
Synonyms:(4-(2-methyl-4- (((1S,2S)-2-(quinolin-2- yl)cyclopropyl)methoxy) pyrimidin-5- yl)phenyl)methanol (enantiomer A) US9663513, 39
TypeSmall organic molecule
Emp. Form.C25H23N3O2
Mol. Mass.397.469
SMILESCc1ncc(-c2ccc(CO)cc2)c(OC[C@H]2C[C@@H]2c2ccc3ccccc3n2)n1