Reaction Details
TargetcAMP and cAMP-inhibited cGMP 3',5'-cyclic phosphodiesterase 10A
LigandBDBM329516
Substrate/Competitorn/a
Meas. Tech.Fluorescence Polarization Assay
Ki 0.020±n/a nM
Citation Kuduk, SDMcComas, CCReger, TS Pyrimidine PDE10 inhibitors US Patent US9663513 Publication Date 5/30/2017
 
cAMP and cAMP-inhibited cGMP 3',5'-cyclic phosphodiesterase 10A
Name:cAMP and cAMP-inhibited cGMP 3',5'-cyclic phosphodiesterase 10A
Type:Protein
Mol. Mass.:88412.52
Organism:Homo sapiens (Human)
Description:Q9Y233
Residue:779
BDBM329516
NameBDBM329516
Synonyms:2-((1S,2S)-2-((2-methyl-5- (3-methylimidazo[1,2- a]pyridin-6-yl)pyrimidin-4- yloxy)methyl)cyclopropyl) quinoline | US9663513, 129
TypeSmall organic molecule
Emp. Form.C26H23N5O
Mol. Mass.421.4937
SMILESCc1cnc2ccc(cn12)-c1cnc(C)nc1OC[C@H]1C[C@@H]1c1ccc2ccccc2n1