Reaction Details
TargetcAMP and cAMP-inhibited cGMP 3',5'-cyclic phosphodiesterase 10A
LigandBDBM329518
Substrate/Competitorn/a
Meas. Tech.Fluorescence Polarization Assay
Ki 0.040±n/a nM
Citation Kuduk, SDMcComas, CCReger, TS Pyrimidine PDE10 inhibitors US Patent US9663513 Publication Date 5/30/2017
 
cAMP and cAMP-inhibited cGMP 3',5'-cyclic phosphodiesterase 10A
Name:cAMP and cAMP-inhibited cGMP 3',5'-cyclic phosphodiesterase 10A
Type:Protein
Mol. Mass.:88412.52
Organism:Homo sapiens (Human)
Description:Q9Y233
Residue:779
BDBM329518
NameBDBM329518
Synonyms:2-((1S,2S)-2-((5-(5- methoxyimidazo[1,2- a]pyridin-7-yl)-2- methylpyrimidin-4- yloxy)methyl)cyclopropyl) quinoline | US9663513, 131
TypeSmall organic molecule
Emp. Form.C26H23N5O2
Mol. Mass.437.4931
SMILESCOc1cc(cc2nccn12)-c1cnc(C)nc1OC[C@H]1C[C@@H]1c1ccc2ccccc2n1