Reaction Details
TargetcAMP and cAMP-inhibited cGMP 3',5'-cyclic phosphodiesterase 10A
LigandBDBM329523
Substrate/Competitorn/a
Meas. Tech.Fluorescence Polarization Assay
Ki 0.040±n/a nM
Citation Kuduk, SDMcComas, CCReger, TS Pyrimidine PDE10 inhibitors US Patent US9663513 Publication Date 5/30/2017
 
cAMP and cAMP-inhibited cGMP 3',5'-cyclic phosphodiesterase 10A
Name:cAMP and cAMP-inhibited cGMP 3',5'-cyclic phosphodiesterase 10A
Type:Protein
Mol. Mass.:88412.52
Organism:Homo sapiens (Human)
Description:Q9Y233
Residue:779
BDBM329523
NameBDBM329523
Synonyms:2-((1S,2S)-2-((5- (imidazo[1,2-a]pyridin-6- yl)-2-methylpyrimidin-4- yloxy)methyl)cyclopropyl) quinoline | US9663513, 136
TypeSmall organic molecule
Emp. Form.C25H21N5O
Mol. Mass.407.4671
SMILESCc1ncc(-c2ccc3nccn3c2)c(OC[C@H]2C[C@@H]2c2ccc3ccccc3n2)n1