Reaction Details
TargetcAMP and cAMP-inhibited cGMP 3',5'-cyclic phosphodiesterase 10A
LigandBDBM329541
Substrate/Competitorn/a
Meas. Tech.Fluorescence Polarization Assay
Ki 0.010±n/a nM
Citation Kuduk, SDMcComas, CCReger, TS Pyrimidine PDE10 inhibitors US Patent US9663513 Publication Date 5/30/2017
 
cAMP and cAMP-inhibited cGMP 3',5'-cyclic phosphodiesterase 10A
Name:cAMP and cAMP-inhibited cGMP 3',5'-cyclic phosphodiesterase 10A
Type:Protein
Mol. Mass.:88412.52
Organism:Homo sapiens (Human)
Description:Q9Y233
Residue:779
BDBM329541
NameBDBM329541
Synonyms:(5-(2-methyl-4-(((1S,2S)- 2-(quinolin-2- yl)cyclopropyl)methoxy) pyrimidin-5-yl)pyridin-2- yl)methanol | US9663513, 154
TypeSmall organic molecule
Emp. Form.C24H22N4O2
Mol. Mass.398.4571
SMILESCc1ncc(-c2ccc(CO)nc2)c(OC[C@H]2C[C@@H]2c2ccc3ccccc3n2)n1