Reaction Details
TargetNuclear receptor ROR-gamma
LigandBDBM329652
Substrate/Competitorn/a
Meas. Tech.Binding Assay
Ki<100±n/a nM
Citation Claremon, DADillard, LWDong, CFan, YLotesta, SDMarcus, ASingh, SBTice, CMYuan, JZhao, WZhuang, L Dihydropyrrolopyridine inhibitors of ROR-gamma US Patent US9663515 Publication Date 5/30/2017
 
Nuclear receptor ROR-gamma
Name:Nuclear receptor ROR-gamma
Type:Enzyme Catalytic Domain
Mol. Mass.:58218.40
Organism:Homo sapiens (Human)
Description:P51449
Residue:518
BDBM329652
NameBDBM329652
Synonyms:US11001583, Compound 8 | US9663515, Compound 8
TypeSmall organic molecule
Emp. Form.C30H40F3N3O4S
Mol. Mass.595.717
SMILESCCS(=O)(=O)c1ccc(cc1)[C@H](COC)NC(=O)c1cnc2[C@H](C(C)C)N(C[C@H]3CC[C@H](CC3)C(F)(F)F)Cc2c1