Reaction Details
TargetBromodomain-containing protein 4
LigandBDBM329773
Substrate/Competitorn/a
Meas. Tech.Time-Resolved Fluorescence Resonance energy Transfer (TR-FRET) Assay
IC50 50.0±n/a nM
Citation Schmees, NKuhnke, JHaendler, BNeuhaus, RLejeune, PSiegel, SKrüger, MFernandez-Montalvan, AEKünzer, HGallenkamp, D BET protein-inhibiting 5-aryltriazoleazepines US Patent US9663523 Publication Date 5/30/2017
 
Bromodomain-containing protein 4
Name:Bromodomain-containing protein 4
Type:Protein
Mol. Mass.:152264.84
Organism:Homo sapiens (Human)
Description:O60885
Residue:1362
BDBM329773
NameBDBM329773
Synonyms:Preparation of (−)-(4R)-6-(4-Chlorophenyl)-4-[(3-cyclopropyl-1,2,4-oxadiazol-5-yl)methyl]-1-methyl-4H-[1,2,4]triazolo[4,3-a][1]benzazepine | US9663523, Example 37
TypeSmall organic molecule
Emp. Form.C24H20ClN5O
Mol. Mass.429.902
SMILESCc1nnc2[C@@H](Cc3nc(no3)C3CC3)C=C(c3ccc(Cl)cc3)c3ccccc3-n12