Reaction Details
TargetBromodomain-containing protein 4
LigandBDBM329774
Substrate/Competitorn/a
Meas. Tech.Time-Resolved Fluorescence Resonance energy Transfer (TR-FRET) Assay
IC50 20.0±n/a nM
Citation Schmees, NKuhnke, JHaendler, BNeuhaus, RLejeune, PSiegel, SKrüger, MFernandez-Montalvan, AEKünzer, HGallenkamp, D BET protein-inhibiting 5-aryltriazoleazepines US Patent US9663523 Publication Date 5/30/2017
 
Bromodomain-containing protein 4
Name:Bromodomain-containing protein 4
Type:Protein
Mol. Mass.:152264.84
Organism:Homo sapiens (Human)
Description:O60885
Residue:1362
BDBM329774
NameBDBM329774
Synonyms:Preparation of (−)-(4R)-6-(4-chlorophenyl)-1-methyl-4-[(5-methyl-1,3,4-oxadiazol-2-yl)methyl]-4H-[1,2,4]triazolo[4,3-a][1]benzazepine | US9663523, Example 38
TypeSmall organic molecule
Emp. Form.C22H18ClN5O
Mol. Mass.403.864
SMILESCc1nnc(C[C@H]2C=C(c3ccc(Cl)cc3)c3ccccc3-n3c(C)nnc23)o1