Reaction Details
TargetBromodomain-containing protein 4
LigandBDBM329783
Substrate/Competitorn/a
Meas. Tech.Time-Resolved Fluorescence Resonance energy Transfer (TR-FRET) Assay
IC50 50.0±n/a nM
Citation Schmees, NKuhnke, JHaendler, BNeuhaus, RLejeune, PSiegel, SKrüger, MFernandez-Montalvan, AEKünzer, HGallenkamp, D BET protein-inhibiting 5-aryltriazoleazepines US Patent US9663523 Publication Date 5/30/2017
 
Bromodomain-containing protein 4
Name:Bromodomain-containing protein 4
Type:Protein
Mol. Mass.:152264.84
Organism:Homo sapiens (Human)
Description:O60885
Residue:1362
BDBM329783
NameBDBM329783
Synonyms:Preparation of 6-(4-chlorophenyl)-8-methoxy-1-methyl-4-[(5-methyl-1,3,4-oxadiazol-2-yl)methyl]-4H-[1,2,4]triazolo[4,3-a][1]benzazepine | US9663523, Example 47
TypeSmall organic molecule
Emp. Form.C23H20ClN5O2
Mol. Mass.433.89
SMILESCOc1ccc-2c(c1)C(=CC(Cc1nnc(C)o1)c1nnc(C)n-21)c1ccc(Cl)cc1