Reaction Details
TargetUbiquitin-conjugating enzyme E2 E1
LigandBDBM329848
Substrate/Competitorn/a
Meas. Tech.HTRF Assay
IC50<10±n/a nM
Citation Afroze, RBharathan, ITCiavarri, JPFleming, PEGaulin, JLGirard, MLangston, SPSoucy, FWong, TYe, Y Pyrazolopyrimidinyl inhibitors of ubiquitin-activating enzyme US Patent US9663525 Publication Date 5/30/2017
 
Ubiquitin-conjugating enzyme E2 E1
Name:Ubiquitin-conjugating enzyme E2 E1
Type:n/a
Mol. Mass.:21408.98
Organism:Homo sapiens (Human)
Description:P51965
Residue:193
BDBM329848
NameBDBM329848
Synonyms:(rac)-((1R,2R,3S,4R)-4-((2-(Dibenzo[b,d]thiophen-4-yl)pyrazolo[1,5-a]pyrimidin-7- US9663525, Compound I-056 | US9796725, Compound I-056
TypeSmall organic molecule
Emp. Form.C24H23N5O5S2
Mol. Mass.525.6
SMILESNS(=O)(=O)OC[C@H]1C[C@@H](Nc2ccnc3cc(nn23)-c2cccc3c4ccccc4sc23)[C@H](O)[C@@H]1O