Reaction Details
TargetUbiquitin-conjugating enzyme E2 E1
LigandBDBM329849
Substrate/Competitorn/a
Meas. Tech.HTRF Assay
IC50<10±n/a nM
Citation Afroze, RBharathan, ITCiavarri, JPFleming, PEGaulin, JLGirard, MLangston, SPSoucy, FWong, TYe, Y Pyrazolopyrimidinyl inhibitors of ubiquitin-activating enzyme US Patent US9663525 Publication Date 5/30/2017
 
Ubiquitin-conjugating enzyme E2 E1
Name:Ubiquitin-conjugating enzyme E2 E1
Type:n/a
Mol. Mass.:21408.98
Organism:Homo sapiens (Human)
Description:P51965
Residue:193
BDBM329849
NameBDBM329849
Synonyms:(rac)-((1R,2R,3S,4R)-4-(2-(5-chloro-2-(trifluoromethoxy)phenyl)pyrazolo[1,5- US9663525, Compound I-057 | US9796725, Compound I-057
TypeSmall organic molecule
Emp. Form.C19H19ClF3N5O6S
Mol. Mass.537.897
SMILESNS(=O)(=O)OC[C@H]1C[C@@H](Nc2ccnc3cc(nn23)-c2cc(Cl)ccc2OC(F)(F)F)[C@H](O)[C@@H]1O