Reaction Details
TargetUbiquitin-conjugating enzyme E2 E1
LigandBDBM329862
Substrate/Competitorn/a
Meas. Tech.HTRF Assay
IC50<10±n/a nM
Citation Afroze, RBharathan, ITCiavarri, JPFleming, PEGaulin, JLGirard, MLangston, SPSoucy, FWong, TYe, Y Pyrazolopyrimidinyl inhibitors of ubiquitin-activating enzyme US Patent US9663525 Publication Date 5/30/2017
 
Ubiquitin-conjugating enzyme E2 E1
Name:Ubiquitin-conjugating enzyme E2 E1
Type:n/a
Mol. Mass.:21408.98
Organism:Homo sapiens (Human)
Description:P51965
Residue:193
BDBM329862
NameBDBM329862
Synonyms:(rac)-((1R,2R,3S,4R)-4-(2-(4-fluoro-2-methoxyphenyl)pyrazolo[1,5-a]pyrimidin-7- US9663525, Compound I-070 | US9796725, Compound I-070
TypeSmall organic molecule
Emp. Form.C19H22FN5O6S
Mol. Mass.467.471
SMILESCOc1cc(F)ccc1-c1cc2nccc(N[C@@H]3C[C@H](COS(N)(=O)=O)[C@@H](O)[C@H]3O)n2n1