Reaction Details
TargetUbiquitin-conjugating enzyme E2 E1
LigandBDBM329879
Substrate/Competitorn/a
Meas. Tech.HTRF Assay
IC50<10±n/a nM
Citation Afroze, RBharathan, ITCiavarri, JPFleming, PEGaulin, JLGirard, MLangston, SPSoucy, FWong, TYe, Y Pyrazolopyrimidinyl inhibitors of ubiquitin-activating enzyme US Patent US9663525 Publication Date 5/30/2017
 
Ubiquitin-conjugating enzyme E2 E1
Name:Ubiquitin-conjugating enzyme E2 E1
Type:n/a
Mol. Mass.:21408.98
Organism:Homo sapiens (Human)
Description:P51965
Residue:193
BDBM329879
NameBDBM329879
Synonyms:(rac)-((1R,2R,3S,4R)-2,3-dihydroxy-4-(2-(3-(2-oxopyrrolidin-1- US9663525, Compound I-087 | US9796725, Compound I-087
TypeSmall organic molecule
Emp. Form.C22H26N6O6S
Mol. Mass.502.543
SMILESNS(=O)(=O)OC[C@H]1C[C@@H](Nc2ccnc3cc(nn23)-c2cccc(c2)N2CCCC2=O)[C@H](O)[C@@H]1O