Reaction Details
TargetUbiquitin-conjugating enzyme E2 E1
LigandBDBM329888
Substrate/Competitorn/a
Meas. Tech.HTRF Assay
IC50<10±n/a nM
Citation Afroze, RBharathan, ITCiavarri, JPFleming, PEGaulin, JLGirard, MLangston, SPSoucy, FWong, TYe, Y Pyrazolopyrimidinyl inhibitors of ubiquitin-activating enzyme US Patent US9663525 Publication Date 5/30/2017
 
Ubiquitin-conjugating enzyme E2 E1
Name:Ubiquitin-conjugating enzyme E2 E1
Type:n/a
Mol. Mass.:21408.98
Organism:Homo sapiens (Human)
Description:P51965
Residue:193
BDBM329888
NameBDBM329888
Synonyms:(rac)-methyl rel-5-[7-({(1R,2S,3R,4R)-2,3-dihydroxy-4- US9663525, Compound I-096 | US9796725, Compound I-096
TypeSmall organic molecule
Emp. Form.C24H25N5O7S
Mol. Mass.527.55
SMILESCOC(=O)c1ccc2c(cccc2c1)-c1cc2nccc(N[C@@H]3C[C@H](COS(N)(=O)=O)[C@@H](O)[C@H]3O)n2n1