Reaction Details
TargetUbiquitin-conjugating enzyme E2 E1
LigandBDBM329903
Substrate/Competitorn/a
Meas. Tech.HTRF Assay
IC50<10±n/a nM
Citation Afroze, RBharathan, ITCiavarri, JPFleming, PEGaulin, JLGirard, MLangston, SPSoucy, FWong, TYe, Y Pyrazolopyrimidinyl inhibitors of ubiquitin-activating enzyme US Patent US9663525 Publication Date 5/30/2017
 
Ubiquitin-conjugating enzyme E2 E1
Name:Ubiquitin-conjugating enzyme E2 E1
Type:n/a
Mol. Mass.:21408.98
Organism:Homo sapiens (Human)
Description:P51965
Residue:193
BDBM329903
NameBDBM329903
Synonyms:(s.e.)-((1R,2R,3S,4R)-4-(2-(6-(difluoromethyl)naphthalen-1-yl)pyrazolo[1,5- US9663525, Compound I-111 | US9796725, Compound I-111
TypeSmall organic molecule
Emp. Form.C23H23F2N5O5S
Mol. Mass.519.521
SMILESNS(=O)(=O)OC[C@H]1C[C@@H](Nc2ccnc3cc(nn23)-c2cccc3cc(ccc23)C(F)F)[C@H](O)[C@@H]1O