Reaction Details
TargetDipeptidyl peptidase 4
LigandBDBM11920
Substrate/CompetitorBDBM11526
Meas. Tech.In Vitro DPP-IV Inhibition Assays
pH7.4±n/a
Temperature295.15±n/a K
Ki 37±4 nM
Citation Zhao, GTaunk, PCMagnin, DRSimpkins, LMRobl, JAWang, ARobertson, JGMarcinkeviciene, JSitkoff, DFParker, RAKirby, MSHamann, LG Diprolyl nitriles as potent dipeptidyl peptidase IV inhibitors. Bioorg Med Chem Lett15:3992-5 (2005) 
 
Dipeptidyl peptidase 4
Name:Dipeptidyl peptidase 4
Type:Enzyme
Mol. Mass.:88235.21
Organism:Sus scrofa (pig)
Description:n/a
Residue:766
BDBM11920
BDBM11526
NameBDBM11920
Synonyms:(1S,3S,5S)-2-{[(2S)-3,3-dimethylpyrrolidin-2-yl]carbonyl}-2-azabicyclo[3.1.0]hexane-3-carbonitrile | substituted diprolyl nitrile 13
TypeSmall organic molecule
Emp. Form.C13H19N3O
Mol. Mass.233.3095
SMILESCC1(C)CCN[C@@H]1C(=O)N1[C@H]2C[C@H]2C[C@H]1C#N