Reaction Details
TargetDipeptidyl peptidase 4
LigandBDBM11925
Substrate/CompetitorBDBM11526
Meas. Tech.In Vitro DPP-IV Inhibition Assays
pH7.4±n/a
Temperature295.15±n/a K
Ki 57±16 nM
Citation Zhao, GTaunk, PCMagnin, DRSimpkins, LMRobl, JAWang, ARobertson, JGMarcinkeviciene, JSitkoff, DFParker, RAKirby, MSHamann, LG Diprolyl nitriles as potent dipeptidyl peptidase IV inhibitors. Bioorg Med Chem Lett15:3992-5 (2005) 
 
Dipeptidyl peptidase 4
Name:Dipeptidyl peptidase 4
Type:Enzyme
Mol. Mass.:88235.21
Organism:Sus scrofa (pig)
Description:n/a
Residue:766
BDBM11925
BDBM11526
NameBDBM11925
Synonyms:9H-fluoren-9-ylmethyl N-[(3S,5S)-5-{[(1S,3S,5S)-3-cyano-2-azabicyclo[3.1.0]hexan-2-yl]carbonyl}pyrrolidin-3-yl]carbamate | substituted diprolyl nitrile 18
TypeSmall organic molecule
Emp. Form.C26H26N4O3
Mol. Mass.442.5096
SMILESO=C(N[C@@H]1CN[C@@H](C1)C(=O)N1[C@H]2C[C@H]2C[C@H]1C#N)OCC1c2ccccc2-c2ccccc12