Reaction Details
TargetDipeptidyl peptidase 4
LigandBDBM11928
Substrate/CompetitorBDBM11526
Meas. Tech.In Vitro DPP-IV Inhibition Assays
pH7.4±n/a
Temperature295.15±n/a K
Ki 3.6±0.3 nM
Citation Zhao, GTaunk, PCMagnin, DRSimpkins, LMRobl, JAWang, ARobertson, JGMarcinkeviciene, JSitkoff, DFParker, RAKirby, MSHamann, LG Diprolyl nitriles as potent dipeptidyl peptidase IV inhibitors. Bioorg Med Chem Lett15:3992-5 (2005) 
 
Dipeptidyl peptidase 4
Name:Dipeptidyl peptidase 4
Type:Enzyme
Mol. Mass.:88235.21
Organism:Sus scrofa (pig)
Description:n/a
Residue:766
BDBM11928
BDBM11526
NameBDBM11928
Synonyms:(1S,3S,5S)-2-{[(2S,4S)-4-[(3-chloro-4-cyanophenyl)amino]pyrrolidin-2-yl]carbonyl}-2-azabicyclo[3.1.0]hexane-3-carbonitrile | substituted diprolyl nitrile 1
TypeSmall organic molecule
Emp. Form.C18H18ClN5O
Mol. Mass.355.821
SMILESClc1cc(N[C@@H]2CN[C@@H](C2)C(=O)N2[C@H]3C[C@H]3C[C@H]2C#N)ccc1C#N