Reaction Details
TargetCarbonic anhydrase 2
LigandBDBM11930
Substrate/CompetitorBDBM11402
Meas. Tech.In Vitro Binding for Human Carbonic Anhydrase II
pH7.4±n/a
Temperature310.15±n/a K
Kd 0.49±.11 nM
Citation Boriack-Sjodin, PAZeitlin, SChen, HHCrenshaw, LGross, SDantanarayana, ADelgado, PMay, JADean, TChristianson, DW Structural analysis of inhibitor binding to human carbonic anhydrase II. Protein Sci7:2483-9 (1998) 
 
Carbonic anhydrase 2
Name:Carbonic anhydrase 2
Type:Enzyme
Mol. Mass.:29250.71
Organism:Homo sapiens (Human)
Description:P00918
Residue:260
BDBM11930
BDBM11402
NameBDBM11930
Synonyms:2-N-[(4-methoxyphenyl)methyl]thiophene-2,5-disulfonamide N-[(4-METHOXYPHENYL)METHYL]2,5-THIOPHENEDESULFONAMIDE
TypeSmall organic molecule
Emp. Form.C12H14N2O5S3
Mol. Mass.362.445
SMILESCOc1ccc(CNS(=O)(=O)c2ccc(s2)S(N)(=O)=O)cc1