Reaction Details
TargetCarbonic anhydrase 2
LigandBDBM11933
Substrate/CompetitorBDBM11402
Meas. Tech.In Vitro Binding for Human Carbonic Anhydrase II
pH7.4±n/a
Temperature310.15±n/a K
Kd 0.16±.01 nM
Citation Boriack-Sjodin, PAZeitlin, SChen, HHCrenshaw, LGross, SDantanarayana, ADelgado, PMay, JADean, TChristianson, DW Structural analysis of inhibitor binding to human carbonic anhydrase II. Protein Sci7:2483-9 (1998) 
 
Carbonic anhydrase 2
Name:Carbonic anhydrase 2
Type:Enzyme
Mol. Mass.:29250.71
Organism:Homo sapiens (Human)
Description:P00918
Residue:260
BDBM11933
BDBM11402
NameBDBM11933
Synonyms:3,4-DIHYDRO-4-HYDROXY-2-(4-METHOXYPHENYL)-2H-THIENO[3,2-E]-1,2-THIAZINE-6-SULFONAMIDE-1,1-DIOXIDE AL5424
TypeSmall organic molecule
Emp. Form.C13H14N2O6S3
Mol. Mass.390.455
SMILESCOc1ccc(cc1)N1CC(O)c2cc(sc2S1(=O)=O)S(N)(=O)=O