Reaction Details
TargetCoagulation factor XI
LigandBDBM330035
Substrate/Competitorn/a
Meas. Tech.Inhibition Assay
Ki 2.40±n/a nM
Citation Neelamkavil, SFEdmondson, SDGuo, ZHruza, AWHussain, ZLesburg, CAMoningka, ROgawa, AKMal, R Factor XIa inhibitors US Patent US9663527 Publication Date 5/30/2017
 
Coagulation factor XI
Name:Coagulation factor XI
Type:Enzyme
Mol. Mass.:70130.58
Organism:Homo sapiens (Human)
Description:P03951
Residue:625
BDBM330035
NameBDBM330035
Synonyms:Methyl [(7S)-7-[6-(aminomethyl)-1-oxo-3,4-dihydroisoquinolin-2(1H)-yl]-2-oxo-1,2,3,4,5,6,7,9-octahydro-11,8-(azeno)-1,9-benzodiazacyclotridecin-14-yl]carbamate | US9663527, Example 1
TypeSmall organic molecule
Emp. Form.C27H31N6O4
Mol. Mass.503.5723
SMILESCOC(=O)Nc1ccc2-c3c[nH]c(n3)[C@H](CCCCC(=O)Nc2c1)N1CCc2cc(C[NH3+])ccc2C1=O