Reaction Details
TargetCoagulation factor XI
LigandBDBM330038
Substrate/Competitorn/a
Meas. Tech.Inhibition Assay
Ki 170±n/a nM
Citation Neelamkavil, SFEdmondson, SDGuo, ZHruza, AWHussain, ZLesburg, CAMoningka, ROgawa, AKMal, R Factor XIa inhibitors US Patent US9663527 Publication Date 5/30/2017
 
Coagulation factor XI
Name:Coagulation factor XI
Type:Enzyme
Mol. Mass.:70130.58
Organism:Homo sapiens (Human)
Description:P03951
Residue:625
BDBM330038
NameBDBM330038
Synonyms:US9663527, Example 4
TypeSmall organic molecule
Emp. Form.C27H27FN4O2
Mol. Mass.458.5273
SMILESNCc1ccc2C(=O)N(CCc2c1)[C@H]1CCCCC(=O)Nc2ccc(F)cc2-c2ccnc1c2