Reaction Details
TargetSolute carrier family 22 member 2
LigandBDBM330040
Substrate/Competitorn/a
Meas. Tech.Inhibition Assay
IC50 250±n/a nM
Citation Desai, MCJin, HLazerwith, SEPyun, HTaylor, JG Substituted 1,2,3,4,6,8,12,12a-octahydro-1,4-methanodipyrido[1,2-a:1',2'-d]pyrazines and methods for treating viral infections US Patent US9663528 Publication Date 5/30/2017
 
Solute carrier family 22 member 2
Name:Solute carrier family 22 member 2
Type:PROTEIN
Mol. Mass.:62591.01
Organism:Homo sapiens (Human)
Description:ChEMBL_1484077
Residue:555
BDBM330040
NameBDBM330040
Synonyms:(2S,5R,13aS)-N-(2,4-difluorobenzyl)-8-hydroxy-7,9-dioxo-2,3,4,5,7,9,13,13a-octahydro-2,5-methanopyrido[1′,2′:4,5]pyrazino[2,1-b][1,3]oxazepine-10-carboxamide US11548901, Compound 3 | US9663528, 3
TypeSmall organic molecule
Emp. Form.C21H19F2N3O5
Mol. Mass.431.3895
SMILESOc1c2C(=O)N3[C@@H]4CC[C@@H](C4)O[C@H]3Cn2cc(C(=O)NCc2ccc(F)cc2F)c1=O