Reaction Details
TargetSolute carrier family 22 member 2
LigandBDBM330054
Substrate/Competitorn/a
Meas. Tech.Inhibition Assay
IC50 94.0±n/a nM
Citation Desai, MCJin, HLazerwith, SEPyun, HTaylor, JG Substituted 1,2,3,4,6,8,12,12a-octahydro-1,4-methanodipyrido[1,2-a:1',2'-d]pyrazines and methods for treating viral infections US Patent US9663528 Publication Date 5/30/2017
 
Solute carrier family 22 member 2
Name:Solute carrier family 22 member 2
Type:PROTEIN
Mol. Mass.:62591.01
Organism:Homo sapiens (Human)
Description:ChEMBL_1484077
Residue:555
BDBM330054
NameBDBM330054
Synonyms:(2R,5S,13aR)-8-hydroxy-7,9-dioxo-N-(2,4,5-trifluorobenzyl)-2,3,4,5,7,9,13,13a-octahydro-2,5-methanopyrido[1′,2′:4,5]pyrazino[2,1-b][1,3]oxazepine-10-carboxamide US11548901, Compound 64 US9732092, Compound 64
TypeSmall organic molecule
Emp. Form.C21H18F3N3O5
Mol. Mass.449.3799
SMILESOc1c2C(=O)N3[C@H]4CC[C@H](C4)O[C@@H]3Cn2cc(C(=O)NCc2cc(F)c(F)cc2F)c1=O