Reaction Details
TargetFalcipain-2
LigandBDBM12034
Substrate/CompetitorBDBM12033
Meas. Tech.Falcipain Enzyme Inhibition Assay
pH5.5±n/a
Temperature295.15±n/a K
IC50 2600±n/a nM
Citation Dominguez, JNLeon, CRodrigues, JGamboa de Dominguez, NGut, JRosenthal, PJ Synthesis and evaluation of new antimalarial phenylurenyl chalcone derivatives. J Med Chem48:3654-8 (2005) 
 
Falcipain-2
Name:Falcipain-2
Synonyms:n/a
Type:Enzyme
Mol. Mass.:55912.57
Organism:Plasmodium falciparum
Description:n/a
Residue:484
BDBM12034
BDBM12033
NameBDBM12034
TypeSmall organic molecule
Emp. Form.C22H16Cl2N2O2
Mol. Mass.411.281
SMILESClc1ccc(NC(=O)Nc2ccc(cc2)C(=O)\C=C\c2ccc(Cl)cc2)cc1