Reaction Details
TargetFalcipain-2
LigandBDBM12041
Substrate/CompetitorBDBM12033
Meas. Tech.Falcipain Enzyme Inhibition Assay
pH5.5±n/a
Temperature295.15±n/a K
IC50 5.8±n/a nM
Citation Dominguez, JNLeon, CRodrigues, JGamboa de Dominguez, NGut, JRosenthal, PJ Synthesis and evaluation of new antimalarial phenylurenyl chalcone derivatives. J Med Chem48:3654-8 (2005) 
 
Falcipain-2
Name:Falcipain-2
Synonyms:n/a
Type:Enzyme
Mol. Mass.:55912.57
Organism:Plasmodium falciparum
Description:n/a
Residue:484
BDBM12041
BDBM12033
NameBDBM12041
TypeSmall organic molecule
Emp. Form.C20H38N6O4
Mol. Mass.426.5535
SMILESCC(C)C[C@H](NC(CCCNC(N)=N)C=O)C(=O)NC(=O)[C@H](CC(C)C)NC(C)=O