Reaction Details
TargetCystathionine gamma-lyase
LigandBDBM330299
Substrate/Competitorn/a
Meas. Tech.In Vitro Assay
IC50<10000±n/a nM
Citation Durón, SGChapman, JSydserff, SGRao, SGStein, GWade, W Cystathionine-γ-lyase (CSE) inhibitors US Patent US9725426 Publication Date 8/8/2017
 
Cystathionine gamma-lyase
Name:Cystathionine gamma-lyase
Type:Protein
Mol. Mass.:44509.52
Organism:Homo sapiens (Human)
Description:P32929
Residue:405
BDBM330299
NameBDBM330299
Synonyms:US9725426, 3
TypeSmall organic molecule
Emp. Form.C4H6N6
Mol. Mass.138.1306
SMILESNN(CC#C)c1nnn[nH]1