Reaction Details
TargetCystathionine gamma-lyase
LigandBDBM330310
Substrate/Competitorn/a
Meas. Tech.In Vitro Assay
IC50 55000±n/a nM
Citation Durón, SGChapman, JSydserff, SGRao, SGStein, GWade, W Cystathionine-γ-lyase (CSE) inhibitors US Patent US9725426 Publication Date 8/8/2017
 
Cystathionine gamma-lyase
Name:Cystathionine gamma-lyase
Type:Protein
Mol. Mass.:44509.52
Organism:Homo sapiens (Human)
Description:P32929
Residue:405
BDBM330310
NameBDBM330310
Synonyms:US9725426, 14
TypeSmall organic molecule
Emp. Form.C4H11N7
Mol. Mass.157.177
SMILESCNCCN(N)c1nnn[nH]1