Reaction Details
TargetCystathionine gamma-lyase
LigandBDBM330317
Substrate/Competitorn/a
Meas. Tech.In Vitro Assay
IC50<10000±n/a nM
Citation Durón, SGChapman, JSydserff, SGRao, SGStein, GWade, W Cystathionine-γ-lyase (CSE) inhibitors US Patent US9725426 Publication Date 8/8/2017
 
Cystathionine gamma-lyase
Name:Cystathionine gamma-lyase
Type:Protein
Mol. Mass.:44509.52
Organism:Homo sapiens (Human)
Description:P32929
Residue:405
BDBM330317
NameBDBM330317
Synonyms:US9725426, 21
TypeSmall organic molecule
Emp. Form.C4H8N6
Mol. Mass.140.1465
SMILESCC(C)=NNc1nnn[nH]1