Reaction Details
TargetCystathionine gamma-lyase
LigandBDBM330320
Substrate/Competitorn/a
Meas. Tech.In Vitro Assay
IC50<10000±n/a nM
Citation Durón, SGChapman, JSydserff, SGRao, SGStein, GWade, W Cystathionine-γ-lyase (CSE) inhibitors US Patent US9725426 Publication Date 8/8/2017
 
Cystathionine gamma-lyase
Name:Cystathionine gamma-lyase
Type:Protein
Mol. Mass.:44509.52
Organism:Homo sapiens (Human)
Description:P32929
Residue:405
BDBM330320
NameBDBM330320
Synonyms:US9725426, 24
TypeSmall organic molecule
Emp. Form.C6H10N6
Mol. Mass.166.1838
SMILESC1CCC(C1)=NNc1nnn[nH]1