Reaction Details
TargetCystathionine gamma-lyase
LigandBDBM330331
Substrate/Competitorn/a
Meas. Tech.In Vitro Assay
IC50<10000±n/a nM
Citation Durón, SGChapman, JSydserff, SGRao, SGStein, GWade, W Cystathionine-γ-lyase (CSE) inhibitors US Patent US9725426 Publication Date 8/8/2017
 
Cystathionine gamma-lyase
Name:Cystathionine gamma-lyase
Type:Protein
Mol. Mass.:44509.52
Organism:Homo sapiens (Human)
Description:P32929
Residue:405
BDBM330331
NameBDBM330331
Synonyms:US9725426, 2-hydrazinylacetic acid
TypeSmall organic molecule
Emp. Form.C2H6N2O2
Mol. Mass.90.0812
SMILESNNCC(O)=O