Reaction Details
TargetCystathionine gamma-lyase
LigandBDBM330332
Substrate/Competitorn/a
Meas. Tech.In Vitro Assay
IC50 55000±n/a nM
Citation Durón, SGChapman, JSydserff, SGRao, SGStein, GWade, W Cystathionine-γ-lyase (CSE) inhibitors US Patent US9725426 Publication Date 8/8/2017
 
Cystathionine gamma-lyase
Name:Cystathionine gamma-lyase
Type:Protein
Mol. Mass.:44509.52
Organism:Homo sapiens (Human)
Description:P32929
Residue:405
BDBM330332
NameBDBM330332
Synonyms:US9725426, 2-(2-(propan-2-ylidene)hydrazinyl)acetic acid
TypeSmall organic molecule
Emp. Form.C5H10N2O2
Mol. Mass.130.1451
SMILES[#6]\[#6](-[#6])=[#7]\[#7]-[#6]-[#6](-[#8])=O