Reaction Details
TargetEyes absent homolog 3
LigandBDBM50158460
Substrate/Competitorn/a
Meas. Tech.Inhibitory Assay
IC50 8300±n/a nM
Citation Hegde, R Use of small molecule inhibitors targeting EYA tyrosine phosphatase US Patent US9725430 Publication Date 8/8/2017
 
Eyes absent homolog 3
Name:Eyes absent homolog 3
Type:Protein
Mol. Mass.:62648.48
Organism:Homo sapiens (Human)
Description:Q99504
Residue:573
BDBM50158460
NameBDBM50158460
Synonyms:(3,5-dibromo-4-hydroxyphenyl)(2-ethyl-1-benzofuran-3-yl)methanone 3,5-dibromo-4-hydroxyphenyl-2-ethyl-3-benzofuranyl ketone CHEMBL388590 US9856239, benzbromarone Uroleap (TN) | cid_2333
TypeSmall organic molecule
Emp. Form.C17H12Br2O3
Mol. Mass.424.083
SMILESCCc1oc2ccccc2c1C(=O)c1cc(Br)c(O)c(Br)c1