Reaction Details
TargetCholesterol side-chain cleavage enzyme, mitochondrial
LigandBDBM330381
Substrate/Competitorn/a
Meas. Tech.Cyp11 Assay
IC50 1300±n/a nM
Citation Blass, BEAbou-Gharbia, MAChilders, WEIyer, PBoruwa, J Cytochrome P450 inhibitors and their method of use US Patent US9725436 Publication Date 8/8/2017
 
Cholesterol side-chain cleavage enzyme, mitochondrial
Name:Cholesterol side-chain cleavage enzyme, mitochondrial
Type:Protein
Mol. Mass.:60346.75
Organism:Bos taurus (Bovine)
Description:P00189
Residue:520
BDBM330381
NameBDBM330381
Synonyms:US9725436, Entry 1
TypeSmall organic molecule
Emp. Form.C23H25ClN6
Mol. Mass.420.938
SMILESNC(=N)N1CCN(CC1)c1ccc(\C=C\c2cc(Cl)cc(Cn3ccnc3)c2)cc1