Reaction Details
TargetCholesterol side-chain cleavage enzyme, mitochondrial
LigandBDBM330383
Substrate/Competitorn/a
Meas. Tech.Cyp11 Assay
IC50 200±n/a nM
Citation Blass, BEAbou-Gharbia, MAChilders, WEIyer, PBoruwa, J Cytochrome P450 inhibitors and their method of use US Patent US9725436 Publication Date 8/8/2017
 
Cholesterol side-chain cleavage enzyme, mitochondrial
Name:Cholesterol side-chain cleavage enzyme, mitochondrial
Type:Protein
Mol. Mass.:60346.75
Organism:Bos taurus (Bovine)
Description:P00189
Residue:520
BDBM330383
NameBDBM330383
Synonyms:US9725436, Entry 3
TypeSmall organic molecule
Emp. Form.C24H24FN3O2S
Mol. Mass.437.53
SMILESCS(=O)(=O)N1CCN(CC1)c1ccc(\C=C\c2cc(F)cc(c2)-c2ccncc2)cc1