Reaction Details
TargetEpidermal growth factor receptor
LigandBDBM330411
Substrate/Competitorn/a
Meas. Tech.Vitro Enzymology Assay
IC50 0.100±n/a nM
Citation Xiao, DZhu, YHu, YWang, HLi, JPeng, YZhang, HLuo, HKong, FHan, Y Quinazoline derivative and preparation method therefor US Patent US9725439 Publication Date 8/8/2017
 
Epidermal growth factor receptor
Name:Epidermal growth factor receptor
Type:Receptor Kinase Domain
Mol. Mass.:134279.59
Organism:Homo sapiens (Human)
Description:P00533
Residue:1210
BDBM330411
NameBDBM330411
Synonyms: N4-(3-acetylphenyl)-N6-(1-acryloylazetidin-3-yl)-7-methoxyquinazoline-4,6-diamine | US9725439, 13
TypeSmall organic molecule
Emp. Form.C23H23N5O3
Mol. Mass.417.4604
SMILESCOc1cc2ncnc(Nc3cccc(c3)C(C)=O)c2cc1NC1CN(C1)C(=O)C=C