Reaction Details
TargetDipeptidyl peptidase 4
LigandBDBM12178
Substrate/CompetitorBDBM11526
Meas. Tech.Enzyme Inhibition Assay
pH8±n/a
Temperature310.15±n/a K
IC50 1.7±n/a nM
Citation Tsai, TYCoumar, MSHsu, THsieh, HPChien, CHChen, CTChang, CNLo, YKWu, SHHuang, CYHuang, YWWang, MHWu, HYLee, HJChen, XChao, YSJiaang, WT Substituted pyrrolidine-2,4-dicarboxylic acid amides as potent dipeptidyl peptidase IV inhibitors. Bioorg Med Chem Lett16:3268-72 (2006) 
 
Dipeptidyl peptidase 4
Name:Dipeptidyl peptidase 4
Type:Enzyme
Mol. Mass.:88271.01
Organism:Homo sapiens (Human)
Description:P27487
Residue:766
BDBM12178
BDBM11526
NameBDBM12178
Synonyms:(2S)-1-{[(2S,4S)-4-(2,3-dihydro-1H-isoindol-2-ylcarbonyl)pyrrolidin-2-yl]carbonyl}pyrrolidine-2-carbonitrile | pyrrolidine-2,4-dicarboxylic acid amide 11a
TypeSmall organic molecule
Emp. Form.C19H22N4O2
Mol. Mass.338.4036
SMILESO=C([C@@H]1CN[C@@H](C1)C(=O)N1CCC[C@H]1C#N)N1Cc2ccccc2C1