Reaction Details
TargetProstaglandin D2 receptor 2
LigandBDBM330424
Substrate/Competitorn/a
Meas. Tech.Receptor Binding Inhibition Assay
Ki 8.20±n/a nM
Citation Hata, KMasuda, MNakai, HTaniyama, DTobinaga, HHato, YFujiu, M Heterocyclic derivative having PGD2 receptor antagonist activity US Patent US9725442 Publication Date 8/8/2017
 
Prostaglandin D2 receptor 2
Name:Prostaglandin D2 receptor 2
Type:Enzyme
Mol. Mass.:43295.45
Organism:Homo sapiens (Human)
Description:Q9Y5Y4
Residue:395
BDBM330424
NameBDBM330424
Synonyms:US9725442, Compound I-10
TypeSmall organic molecule
Emp. Form.C23H26FN3O5S
Mol. Mass.475.533
SMILESCC(C)Oc1ccc(cc1)S(=O)(=O)N1C[C@@H](C[C@H]1C)n1nc(CC(O)=O)c2ccc(F)cc12