Reaction Details
TargetProstaglandin D2 receptor 2
LigandBDBM330436
Substrate/Competitorn/a
Meas. Tech.Receptor Binding Inhibition Assay
Ki 5.10±n/a nM
Citation Hata, KMasuda, MNakai, HTaniyama, DTobinaga, HHato, YFujiu, M Heterocyclic derivative having PGD2 receptor antagonist activity US Patent US9725442 Publication Date 8/8/2017
 
Prostaglandin D2 receptor 2
Name:Prostaglandin D2 receptor 2
Type:Enzyme
Mol. Mass.:43295.45
Organism:Homo sapiens (Human)
Description:Q9Y5Y4
Residue:395
BDBM330436
NameBDBM330436
Synonyms:US9725442, Compound I-52
TypeSmall organic molecule
Emp. Form.C23H25F2N3O5S
Mol. Mass.493.524
SMILESCC(C)Oc1ccc(c(F)c1)S(=O)(=O)N1C[C@@H](C)[C@H](C1)n1nc(CC(O)=O)c2ccc(F)cc12