Reaction Details
TargetProstaglandin D2 receptor 2
LigandBDBM330446
Substrate/Competitorn/a
Meas. Tech.Receptor Binding Inhibition Assay
Ki 2.80±n/a nM
Citation Hata, KMasuda, MNakai, HTaniyama, DTobinaga, HHato, YFujiu, M Heterocyclic derivative having PGD2 receptor antagonist activity US Patent US9725442 Publication Date 8/8/2017
 
Prostaglandin D2 receptor 2
Name:Prostaglandin D2 receptor 2
Type:Enzyme
Mol. Mass.:43295.45
Organism:Homo sapiens (Human)
Description:Q9Y5Y4
Residue:395
BDBM330446
NameBDBM330446
Synonyms:US9725442, Compound I-85
TypeSmall organic molecule
Emp. Form.C23H25F2N3O5S
Mol. Mass.493.524
SMILESCC(C)Oc1ccc(cc1)S(=O)(=O)N1C[C@H](n2nc(CC(O)=O)c3ccc(F)cc23)[C@@](C)(F)C1